Reaction Details
TargetEstrogen receptor beta
LigandBDBM50187957
Substrate/Competitorn/a
Meas. Tech.ChEMBL_383639 (CHEMBL868002)
IC50 8±n/a nM
Citation Wilkening, RRRatcliffe, RWFried, AKMeng, DSun, WColwell, LLambert, SGreenlee, MNilsson, SThorsell, AMojena, MTudela, CFrisch, KChan, WBirzin, ETRohrer, SPHammond, ML Estrogen receptor beta-subtype selective tetrahydrofluorenones: use of a fused pyrazole as a phenol bioisostere. Bioorg Med Chem Lett16:3896-901 (2006) 
 
Estrogen receptor beta
Name:Estrogen receptor beta
Type:Protein
Mol. Mass.:59238.43
Organism:Homo sapiens (Human)
Description:Q92731
Residue:530
BDBM50187957
NameBDBM50187957
Synonyms:CHEMBL379595 | rac-6-bromo-9a-ethyl-9,9a-dihydroindeno[2,1-e]indazole-7,10(3H,8H)-dione
TypeSmall organic molecule
Emp. Form.C16H13BrN2O2
Mol. Mass.345.191
SMILESCCC12CCC(=O)C(Br)=C1c1ccc3[nH]ncc3c1C2=O