Reaction Details
TargetEstrogen receptor beta
LigandBDBM50187965
Substrate/Competitorn/a
Meas. Tech.ChEMBL_383639 (CHEMBL868002)
IC50 4±n/a nM
Citation Wilkening, RRRatcliffe, RWFried, AKMeng, DSun, WColwell, LLambert, SGreenlee, MNilsson, SThorsell, AMojena, MTudela, CFrisch, KChan, WBirzin, ETRohrer, SPHammond, ML Estrogen receptor beta-subtype selective tetrahydrofluorenones: use of a fused pyrazole as a phenol bioisostere. Bioorg Med Chem Lett16:3896-901 (2006) 
 
Estrogen receptor beta
Name:Estrogen receptor beta
Type:Protein
Mol. Mass.:59238.43
Organism:Homo sapiens (Human)
Description:Q92731
Residue:530
BDBM50187965
NameBDBM50187965
Synonyms:(R)-6-bromo-9a-(cyclopropylmethyl)-8,9,9a,10-tetrahydroindeno[2,1-e]indazol-7(3H)-one | CHEMBL211666
TypeSmall organic molecule
Emp. Form.C18H17BrN2O
Mol. Mass.357.244
SMILESBrC1=C2c3ccc4[nH]ncc4c3C[C@]2(CC2CC2)CCC1=O