Reaction Details
TargetEstrogen receptor beta
LigandBDBM50187958
Substrate/Competitorn/a
Meas. Tech.ChEMBL_383639 (CHEMBL868002)
IC50 7.2±n/a nM
Citation Wilkening, RRRatcliffe, RWFried, AKMeng, DSun, WColwell, LLambert, SGreenlee, MNilsson, SThorsell, AMojena, MTudela, CFrisch, KChan, WBirzin, ETRohrer, SPHammond, ML Estrogen receptor beta-subtype selective tetrahydrofluorenones: use of a fused pyrazole as a phenol bioisostere. Bioorg Med Chem Lett16:3896-901 (2006) 
 
Estrogen receptor beta
Name:Estrogen receptor beta
Type:Protein
Mol. Mass.:59238.43
Organism:Homo sapiens (Human)
Description:Q92731
Residue:530
BDBM50187958
NameBDBM50187958
Synonyms:(S)-9a-ethyl-6-methyl-8,9,9a,10-tetrahydroindeno[2,1-e]indazol-7(3H)-one | CHEMBL210074
TypeSmall organic molecule
Emp. Form.C17H18N2O
Mol. Mass.266.3376
SMILESCC[C@]12Cc3c(ccc4[nH]ncc34)C1=C(C)C(=O)CC2