Reaction Details
TargetMelanin-concentrating hormone receptor 1
LigandBDBM50188315
Substrate/Competitorn/a
Meas. Tech.ChEMBL_390360 (CHEMBL869840)
Ki 8.5±n/a nM
Citation McBriar, MDGuzik, HShapiro, SXu, RParuchova, JClader, JWO'neill, KHawes, BSorota, SMargulis, MTucker, KWeston, DJCox, K Bicyclo[3.1.0]hexyl urea melanin concentrating hormone (MCH) receptor-1 antagonists: impacting hERG liability via aryl modifications. Bioorg Med Chem Lett16:4262-5 (2006) 
 
Melanin-concentrating hormone receptor 1
Name:Melanin-concentrating hormone receptor 1
Type:G Protein-Coupled Receptor (GPCR)
Mol. Mass.:45976.27
Organism:Homo sapiens (Human)
Description:Membranes from CHO-K1 cells stably expressing human MCH1R were used in assays.
Residue:422
BDBM50188315
NameBDBM50188315
Synonyms:3-(4-fluoro-3-(trifluoromethyl)phenyl)-1-(3-(4-methylpiperazin-1-yl)propyl)-1-((1S,2R,5S)-5-(4-(methylsulfonyl)phenyl)bicyclo[3.1.0]hexan-2-yl)urea | CHEMBL379978
TypeSmall organic molecule
Emp. Form.C29H36F4N4O3S
Mol. Mass.596.68
SMILESCN1CCN(CCCN([C@@H]2CC[C@@]3(C[C@H]23)c2ccc(cc2)S(C)(=O)=O)C(=O)Nc2ccc(F)c(c2)C(F)(F)F)CC1