Reaction Details
TargetMelanin-concentrating hormone receptor 1
LigandBDBM50188320
Substrate/Competitorn/a
Meas. Tech.ChEMBL_390360 (CHEMBL869840)
Ki 2.6±n/a nM
Citation McBriar, MDGuzik, HShapiro, SXu, RParuchova, JClader, JWO'neill, KHawes, BSorota, SMargulis, MTucker, KWeston, DJCox, K Bicyclo[3.1.0]hexyl urea melanin concentrating hormone (MCH) receptor-1 antagonists: impacting hERG liability via aryl modifications. Bioorg Med Chem Lett16:4262-5 (2006) 
 
Melanin-concentrating hormone receptor 1
Name:Melanin-concentrating hormone receptor 1
Type:G Protein-Coupled Receptor (GPCR)
Mol. Mass.:45976.27
Organism:Homo sapiens (Human)
Description:Membranes from CHO-K1 cells stably expressing human MCH1R were used in assays.
Residue:422
BDBM50188320
NameBDBM50188320
Synonyms:3-(3-chloro-4-fluorophenyl)-1-((1S,2R,5S)-5-(4-fluorophenyl)bicyclo[3.1.0]hexan-2-yl)-1-(3-(4-methylpiperazin-1-yl)propyl)urea | CHEMBL379535
TypeSmall organic molecule
Emp. Form.C27H33ClF2N4O
Mol. Mass.503.027
SMILESCN1CCN(CCCN([C@@H]2CC[C@@]3(C[C@H]23)c2ccc(F)cc2)C(=O)Nc2ccc(F)c(Cl)c2)CC1