Reaction Details
TargetMelanin-concentrating hormone receptor 1
LigandBDBM50188332
Substrate/Competitorn/a
Meas. Tech.ChEMBL_390360 (CHEMBL869840)
Ki 17±n/a nM
Citation McBriar, MDGuzik, HShapiro, SXu, RParuchova, JClader, JWO'neill, KHawes, BSorota, SMargulis, MTucker, KWeston, DJCox, K Bicyclo[3.1.0]hexyl urea melanin concentrating hormone (MCH) receptor-1 antagonists: impacting hERG liability via aryl modifications. Bioorg Med Chem Lett16:4262-5 (2006) 
 
Melanin-concentrating hormone receptor 1
Name:Melanin-concentrating hormone receptor 1
Type:G Protein-Coupled Receptor (GPCR)
Mol. Mass.:45976.27
Organism:Homo sapiens (Human)
Description:Membranes from CHO-K1 cells stably expressing human MCH1R were used in assays.
Residue:422
BDBM50188332
NameBDBM50188332
Synonyms:3-(4-fluoro-3-(trifluoromethyl)phenyl)-1-((1S,2R,5S)-5-(4-(methylcarbamoyl)phenyl)bicyclo[3.1.0]hexan-2-yl)-1-(3-(4-methylpiperazin-1-yl)propyl)urea | CHEMBL213649
TypeSmall organic molecule
Emp. Form.C30H37F4N5O2
Mol. Mass.575.6407
SMILESCNC(=O)c1ccc(cc1)[C@@]12C[C@@H]1[C@@H](CC2)N(CCCN1CCN(C)CC1)C(=O)Nc1ccc(F)c(c1)C(F)(F)F