Reaction Details
TargetReplicase polyprotein 1a
LigandBDBM50188383
Substrate/Competitorn/a
Meas. Tech.ChEMBL_362485 (CHEMBL868157)
Ki 19100±n/a nM
Citation Zhou, LLiu, YZhang, WWei, PHuang, CPei, JYuan, YLai, L Isatin compounds as noncovalent SARS coronavirus 3C-like protease inhibitors. J Med Chem49:3440-3 (2006) 
 
Replicase polyprotein 1a
Name:Replicase polyprotein 1a
Type:Enzyme
Mol. Mass.:486353.36
Organism:Human SARS coronavirus (SARS-CoV)
Description:P0C6U8
Residue:4382
BDBM50188383
NameBDBM50188383
Synonyms:1-butyl-2,3-dioxoindoline-5-carboxamide acs.jmedchem.1c00409_ST.598
TypeSmall organic molecule
Emp. Form.C13H14N2O3
Mol. Mass.246.2619
SMILESCCCCN1C(=O)C(=O)c2cc(ccc12)C(N)=O