Reaction Details
TargetChymotrypsinogen B
LigandBDBM50055218
Substrate/Competitorn/a
Meas. Tech.ChEMBL_362488 (CHEMBL866986)
IC50 34000±n/a nM
Citation Zhou, LLiu, YZhang, WWei, PHuang, CPei, JYuan, YLai, L Isatin compounds as noncovalent SARS coronavirus 3C-like protease inhibitors. J Med Chem49:3440-3 (2006) 
 
Chymotrypsinogen B
Name:Chymotrypsinogen B
Type:PROTEIN
Mol. Mass.:27871.19
Organism:Homo sapiens (Human)
Description:ChEMBL_216634
Residue:263
BDBM50055218
NameBDBM50055218
Synonyms:1-(2-naphthlmethyl) isatin-5-carboxamide CHEMBL358279 med.21724, Compound 108
TypeSmall organic molecule
Emp. Form.C20H14N2O3
Mol. Mass.330.3368
SMILESNC(=O)c1ccc2N(Cc3ccc4ccccc4c3)C(=O)C(=O)c2c1