Reaction Details
TargetPapain
LigandBDBM50055218
Substrate/Competitorn/a
Meas. Tech.ChEMBL_362487 (CHEMBL868162)
IC50 11000±n/a nM
Citation Zhou, LLiu, YZhang, WWei, PHuang, CPei, JYuan, YLai, L Isatin compounds as noncovalent SARS coronavirus 3C-like protease inhibitors. J Med Chem49:3440-3 (2006) 
 
Papain
Name:Papain
Type:Enzyme
Mol. Mass.:38923.01
Organism:Carica papaya
Description:Papain was purchased from Sigma, Germany.
Residue:345
BDBM50055218
NameBDBM50055218
Synonyms:1-(2-naphthlmethyl) isatin-5-carboxamide CHEMBL358279 med.21724, Compound 108
TypeSmall organic molecule
Emp. Form.C20H14N2O3
Mol. Mass.330.3368
SMILESNC(=O)c1ccc2N(Cc3ccc4ccccc4c3)C(=O)C(=O)c2c1