Reaction Details
TargetGlucocorticoid receptor
LigandBDBM50188390
Substrate/Competitorn/a
Meas. Tech.ChEMBL_362619 (CHEMBL853229)
IC50 2090±n/a nM
Citation Schuster, DMaurer, EMLaggner, CNashev, LGWilckens, TLanger, TOdermatt, A The discovery of new 11beta-hydroxysteroid dehydrogenase type 1 inhibitors by common feature pharmacophore modeling and virtual screening. J Med Chem49:3454-66 (2006) 
 
Glucocorticoid receptor
Name:Glucocorticoid receptor
Type:Enzyme
Mol. Mass.:85656.87
Organism:Homo sapiens (Human)
Description:P04150
Residue:777
BDBM50188390
NameBDBM50188390
Synonyms:4-((5R,10S,13R,14R)-3-acetoxy-4,4,10,13,14-pentamethyl-7,11-dioxo-2,3,4,5,6,7,10,11,12,13,14,15,16,17-tetradecahydro-1H-cyclopenta[a]phenanthren-17-yl)pentanoic acid | CHEMBL211039
TypeSmall organic molecule
Emp. Form.C29H42O6
Mol. Mass.486.6402
SMILESCC(CCC(O)=O)C1CC[C@@]2(C)C3=C(C(=O)C[C@]12C)[C@@]1(C)CCC(OC(C)=O)C(C)(C)[C@@H]1CC3=O