Reaction Details
Target11-beta-hydroxysteroid dehydrogenase 1
LigandBDBM50188391
Substrate/Competitorn/a
Meas. Tech.ChEMBL_362614 (CHEMBL853223)
IC50>50000±n/a nM
Citation Schuster, DMaurer, EMLaggner, CNashev, LGWilckens, TLanger, TOdermatt, A The discovery of new 11beta-hydroxysteroid dehydrogenase type 1 inhibitors by common feature pharmacophore modeling and virtual screening. J Med Chem49:3454-66 (2006) 
 
11-beta-hydroxysteroid dehydrogenase 1
Name:11-beta-hydroxysteroid dehydrogenase 1
Type:Enzyme
Mol. Mass.:32409.16
Organism:Homo sapiens (Human)
Description:P28845
Residue:292
BDBM50188391
NameBDBM50188391
Synonyms:4-(2,4-dichlorophenyl)-2-hydroxy-3-(4-methoxy-3-methylbenzoyl)-5-(2-methoxyethyl)cyclopent-2-enone | CHEMBL206908
TypeSmall organic molecule
Emp. Form.C23H22Cl2O5
Mol. Mass.449.324
SMILESCOCCC1C(C(C(=O)c2ccc(OC)c(C)c2)C(=O)C1=O)c1ccc(Cl)cc1Cl