Reaction Details
Target11-beta-hydroxysteroid dehydrogenase type 2
LigandBDBM50188386
Substrate/Competitorn/a
Meas. Tech.ChEMBL_362615 (CHEMBL853224)
IC50 48000±n/a nM
Citation Schuster, DMaurer, EMLaggner, CNashev, LGWilckens, TLanger, TOdermatt, A The discovery of new 11beta-hydroxysteroid dehydrogenase type 1 inhibitors by common feature pharmacophore modeling and virtual screening. J Med Chem49:3454-66 (2006) 
 
11-beta-hydroxysteroid dehydrogenase type 2
Name:11-beta-hydroxysteroid dehydrogenase type 2
Type:Enzyme
Mol. Mass.:44141.72
Organism:Homo sapiens (Human)
Description:Purified recombinant human 11beta-HSD2.
Residue:405
BDBM50188386
NameBDBM50188386
Synonyms:2-((3S,4aR,6aR,6bS,8aS,11S,12aR,14aR,14bS)-11-(methoxycarbonyl)-4,4,6a,6b,8a,11,14b-heptamethyl-14-oxo-1,2,3,4,4a,5,6,6a,6b,7,8,8a,9,10,11,12,12a,14,14a,14b-icosahydropicen-3-yloxy)benzoic acid | CHEMBL382614
TypeSmall organic molecule
Emp. Form.C38H52O6
Mol. Mass.604.8159
SMILESCOC(=O)[C@@]1(C)CC[C@]2(C)CC[C@]3(C)C(=CC(=O)[C@@H]4[C@@]5(C)CC[C@H](Oc6ccccc6C(O)=O)C(C)(C)[C@@H]5CC[C@@]34C)[C@@H]2C1