Reaction Details
Target11-beta-hydroxysteroid dehydrogenase 1
LigandBDBM50188389
Substrate/Competitorn/a
Meas. Tech.ChEMBL_362606 (CHEMBL863120)
IC50 2030±n/a nM
Citation Schuster, DMaurer, EMLaggner, CNashev, LGWilckens, TLanger, TOdermatt, A The discovery of new 11beta-hydroxysteroid dehydrogenase type 1 inhibitors by common feature pharmacophore modeling and virtual screening. J Med Chem49:3454-66 (2006) 
 
11-beta-hydroxysteroid dehydrogenase 1
Name:11-beta-hydroxysteroid dehydrogenase 1
Type:Enzyme
Mol. Mass.:32409.16
Organism:Homo sapiens (Human)
Description:P28845
Residue:292
BDBM50188389
NameBDBM50188389
Synonyms:CHEMBL210465 | N-(3,4-dimethoxyphenethyl)-4,7,7-trimethyl-2,3-dioxobicyclo[2.2.1]heptane-1-carboxamide
TypeSmall organic molecule
Emp. Form.C21H27NO5
Mol. Mass.373.4428
SMILESCOc1ccc(CCNC(=O)C23CCC(C)(C(=O)C2=O)C3(C)C)cc1OC