Reaction Details
TargetFibroblast growth factor receptor 2
LigandBDBM50593531
Substrate/Competitorn/a
Meas. Tech.ChEMBL_2253973 (CHEMBL5168183)
IC50 0.470000±n/a nM
Citation Zhang, XWang, YJi, JSi, DBao, XYu, ZZhu, YZhao, LLi, WLiu, J Discovery of 1,6-Naphthyridin-2(1 J Med Chem65:7595-7618 (2022) 
 
Fibroblast growth factor receptor 2
Name:Fibroblast growth factor receptor 2
Type:Enzyme
Mol. Mass.:92015.45
Organism:Homo sapiens (Human)
Description:P21802
Residue:821
BDBM50593531
NameBDBM50593531
Synonyms:ASP-5878 Asp 5878 Asp5878
TypeSmall organic molecule
Emp. Form.C18H19F2N5O4
Mol. Mass.407.3714
SMILESCOc1cc(OC)c(F)c(COc2cnc(Nc3cnn(CCO)c3)nc2)c1F