Reaction Details
TargetMu-type opioid receptor
LigandBDBM50188534
Substrate/Competitorn/a
Meas. Tech.ChEMBL_364001 (CHEMBL860178)
Ki 41.3±n/a nM
Citation Vázquez, MEBlanco, JBSalvadori, STrapella, CArgazzi, RBryant, SDJinsmaa, YLazarus, LHNegri, LGiannini, ELattanzi, RColucci, MBalboni, G 6-N,N-dimethylamino-2,3-naphthalimide: a new environment-sensitive fluorescent probe in delta- and mu-selective opioid peptides. J Med Chem49:3653-8 (2006) 
 
Mu-type opioid receptor
Name:Mu-type opioid receptor
Type:G Protein-Coupled Receptor (GPCR)
Mol. Mass.:44503.11
Organism:Rattus norvegicus (rat)
Description:Competition binding assays were carried out using membrane preparations from transfected HN9.10 cells that constitutively expressed the mu opioid receptor.
Residue:398
BDBM50188534
NameBDBM50188534
Synonyms:(H-Dmt-Tic-Glu-NH-(CH(2))(5)-CO-Dap(6DMN)-NH(2) | CHEMBL426320
TypeSmall organic molecule
Emp. Form.C49H58N8O10
Mol. Mass.919.0324
SMILESCN(C)c1ccc2cc3C(=O)N(CC(NC(=O)CCCCCNC(=O)[C@H](CCC(O)=O)NC(=O)C4Cc5ccccc5CN4C(=O)[C@@H](N)Cc4c(C)cc(O)cc4C)C(N)=O)C(=O)c3cc2c1