Reaction Details
TargetThromboxane A2 receptor
LigandBDBM50188612
Substrate/Competitorn/a
Meas. Tech.ChEMBL_364277 (CHEMBL863215)
IC50 1.58±n/a nM
Citation Hanson, JReynaud, DQiao, NDevel, PMoray, ALRenard, JFKelley, LPWinum, JYMontero, JLKinsella, BTPirotte, BPace-Asciak, CRDogné, JM Synthesis and pharmacological evaluation of novel nitrobenzenic thromboxane modulators as antiplatelet agents acting on both the alpha and beta isoforms of the human thromboxane receptor. J Med Chem49:3701-9 (2006) 
 
Thromboxane A2 receptor
Name:Thromboxane A2 receptor
Type:Enyzme
Mol. Mass.:37445.28
Organism:Homo sapiens (Human)
Description:P21731
Residue:343
BDBM50188612
NameBDBM50188612
Synonyms:CHEMBL208818 | N-n-hexyl-N'-[2-(4-methylphenoxy)-5-nitrobenzenesulfonyl]urea
TypeSmall organic molecule
Emp. Form.C20H25N3O6S
Mol. Mass.435.494
SMILESCCCCCCNC(=O)NS(=O)(=O)c1cc(ccc1Oc1ccc(C)cc1)[N+]([O-])=O