Reaction Details
TargetThromboxane A2 receptor
LigandBDBM50188618
Substrate/Competitorn/a
Meas. Tech.ChEMBL_364276 (CHEMBL863214)
IC50 0.46±n/a nM
Citation Hanson, JReynaud, DQiao, NDevel, PMoray, ALRenard, JFKelley, LPWinum, JYMontero, JLKinsella, BTPirotte, BPace-Asciak, CRDogné, JM Synthesis and pharmacological evaluation of novel nitrobenzenic thromboxane modulators as antiplatelet agents acting on both the alpha and beta isoforms of the human thromboxane receptor. J Med Chem49:3701-9 (2006) 
 
Thromboxane A2 receptor
Name:Thromboxane A2 receptor
Type:Enyzme
Mol. Mass.:37445.28
Organism:Homo sapiens (Human)
Description:P21731
Residue:343
BDBM50188618
NameBDBM50188618
Synonyms:CHEMBL209168 | N-[2-(4-methylphenylamino)-5-nitrobenzenesulfonyl]-piperidine-1-carboxamide
TypeSmall organic molecule
Emp. Form.C19H22N4O5S
Mol. Mass.418.467
SMILESCc1ccc(Nc2ccc(cc2S(=O)(=O)NC(=O)N2CCCCC2)[N+]([O-])=O)cc1