Reaction Details
TargetThromboxane A2 receptor
LigandBDBM50188615
Substrate/Competitorn/a
Meas. Tech.ChEMBL_364276 (CHEMBL863214)
IC50 2.63±n/a nM
Citation Hanson, JReynaud, DQiao, NDevel, PMoray, ALRenard, JFKelley, LPWinum, JYMontero, JLKinsella, BTPirotte, BPace-Asciak, CRDogné, JM Synthesis and pharmacological evaluation of novel nitrobenzenic thromboxane modulators as antiplatelet agents acting on both the alpha and beta isoforms of the human thromboxane receptor. J Med Chem49:3701-9 (2006) 
 
Thromboxane A2 receptor
Name:Thromboxane A2 receptor
Type:Enyzme
Mol. Mass.:37445.28
Organism:Homo sapiens (Human)
Description:P21731
Residue:343
BDBM50188615
NameBDBM50188615
Synonyms:CHEMBL274415 | N-n-pentyl-N'-[2-(4-methylphenoxy)-5-nitrobenzenesulfonyl]urea
TypeSmall organic molecule
Emp. Form.C19H23N3O6S
Mol. Mass.421.467
SMILESCCCCCNC(=O)NS(=O)(=O)c1cc(ccc1Oc1ccc(C)cc1)[N+]([O-])=O