Reaction Details
TargetThromboxane A2 receptor
LigandBDBM50188610
Substrate/Competitorn/a
Meas. Tech.ChEMBL_364276 (CHEMBL863214)
IC50 1.52±n/a nM
Citation Hanson, JReynaud, DQiao, NDevel, PMoray, ALRenard, JFKelley, LPWinum, JYMontero, JLKinsella, BTPirotte, BPace-Asciak, CRDogné, JM Synthesis and pharmacological evaluation of novel nitrobenzenic thromboxane modulators as antiplatelet agents acting on both the alpha and beta isoforms of the human thromboxane receptor. J Med Chem49:3701-9 (2006) 
 
Thromboxane A2 receptor
Name:Thromboxane A2 receptor
Type:Enyzme
Mol. Mass.:37445.28
Organism:Homo sapiens (Human)
Description:P21731
Residue:343
BDBM50188610
NameBDBM50188610
Synonyms:CHEMBL208543 | N-cyclohexyl-N'-[2-(4-methylphenoxy)-5-nitrobenzenesulfonyl]urea
TypeSmall organic molecule
Emp. Form.C20H23N3O6S
Mol. Mass.433.478
SMILESCc1ccc(Oc2ccc(cc2S(=O)(=O)NC(=O)NC2CCCCC2)[N+]([O-])=O)cc1