Reaction Details
TargetThromboxane A2 receptor
LigandBDBM50188613
Substrate/Competitorn/a
Meas. Tech.ChEMBL_364277 (CHEMBL863215)
IC50 0.58±n/a nM
Citation Hanson, JReynaud, DQiao, NDevel, PMoray, ALRenard, JFKelley, LPWinum, JYMontero, JLKinsella, BTPirotte, BPace-Asciak, CRDogné, JM Synthesis and pharmacological evaluation of novel nitrobenzenic thromboxane modulators as antiplatelet agents acting on both the alpha and beta isoforms of the human thromboxane receptor. J Med Chem49:3701-9 (2006) 
 
Thromboxane A2 receptor
Name:Thromboxane A2 receptor
Type:Enyzme
Mol. Mass.:37445.28
Organism:Homo sapiens (Human)
Description:P21731
Residue:343
BDBM50188613
NameBDBM50188613
Synonyms:CHEMBL209134 | N-n-pentyl-N'-[2-(3-methyl-4-bromophenylamino)-5-nitrobenzenesulfonyl]urea
TypeSmall organic molecule
Emp. Form.C19H23BrN4O5S
Mol. Mass.499.379
SMILESCCCCCNC(=O)NS(=O)(=O)c1cc(ccc1Nc1ccc(Br)c(C)c1)[N+]([O-])=O