Reaction Details
TargetThromboxane A2 receptor
LigandBDBM50188617
Substrate/Competitorn/a
Meas. Tech.ChEMBL_364277 (CHEMBL863215)
IC50 1.77±n/a nM
Citation Hanson, JReynaud, DQiao, NDevel, PMoray, ALRenard, JFKelley, LPWinum, JYMontero, JLKinsella, BTPirotte, BPace-Asciak, CRDogné, JM Synthesis and pharmacological evaluation of novel nitrobenzenic thromboxane modulators as antiplatelet agents acting on both the alpha and beta isoforms of the human thromboxane receptor. J Med Chem49:3701-9 (2006) 
 
Thromboxane A2 receptor
Name:Thromboxane A2 receptor
Type:Enyzme
Mol. Mass.:37445.28
Organism:Homo sapiens (Human)
Description:P21731
Residue:343
BDBM50188617
NameBDBM50188617
Synonyms:CHEMBL209035 | N-tert-butyl-N'-[2-(4-methylphenoxy)-5-nitrobenzenesulfonyl]urea
TypeSmall organic molecule
Emp. Form.C18H21N3O6S
Mol. Mass.407.441
SMILESCc1ccc(Oc2ccc(cc2S(=O)(=O)NC(=O)NC(C)(C)C)[N+]([O-])=O)cc1