Reaction Details
TargetThromboxane A2 receptor
LigandBDBM50188621
Substrate/Competitorn/a
Meas. Tech.ChEMBL_364276 (CHEMBL863214)
IC50 1.52±n/a nM
Citation Hanson, JReynaud, DQiao, NDevel, PMoray, ALRenard, JFKelley, LPWinum, JYMontero, JLKinsella, BTPirotte, BPace-Asciak, CRDogné, JM Synthesis and pharmacological evaluation of novel nitrobenzenic thromboxane modulators as antiplatelet agents acting on both the alpha and beta isoforms of the human thromboxane receptor. J Med Chem49:3701-9 (2006) 
 
Thromboxane A2 receptor
Name:Thromboxane A2 receptor
Type:Enyzme
Mol. Mass.:37445.28
Organism:Homo sapiens (Human)
Description:P21731
Residue:343
BDBM50188621
NameBDBM50188621
Synonyms:CHEMBL377679 | N-n-pentyl-N'-[2-(2, 6-dimethylphenylamino)-5-nitrobenzenesulfonyl]urea
TypeSmall organic molecule
Emp. Form.C20H26N4O5S
Mol. Mass.434.509
SMILESCCCCCNC(=O)NS(=O)(=O)c1cc(ccc1Nc1c(C)cccc1C)[N+]([O-])=O