Reaction Details
TargetThromboxane A2 receptor
LigandBDBM50188620
Substrate/Competitorn/a
Meas. Tech.ChEMBL_364277 (CHEMBL863215)
IC50 1.07±n/a nM
Citation Hanson, JReynaud, DQiao, NDevel, PMoray, ALRenard, JFKelley, LPWinum, JYMontero, JLKinsella, BTPirotte, BPace-Asciak, CRDogné, JM Synthesis and pharmacological evaluation of novel nitrobenzenic thromboxane modulators as antiplatelet agents acting on both the alpha and beta isoforms of the human thromboxane receptor. J Med Chem49:3701-9 (2006) 
 
Thromboxane A2 receptor
Name:Thromboxane A2 receptor
Type:Enyzme
Mol. Mass.:37445.28
Organism:Homo sapiens (Human)
Description:P21731
Residue:343
BDBM50188620
NameBDBM50188620
Synonyms:CHEMBL379736 | N-n-hexyl-N'-[2-(cyclohexylamino)-5-nitrobenzenesulfonyl]urea
TypeSmall organic molecule
Emp. Form.C19H30N4O5S
Mol. Mass.426.53
SMILESCCCCCCNC(=O)NS(=O)(=O)c1cc(ccc1NC1CCCCC1)[N+]([O-])=O