Reaction Details
TargetThromboxane A2 receptor
LigandBDBM50188609
Substrate/Competitorn/a
Meas. Tech.ChEMBL_364277 (CHEMBL863215)
IC50 1.17±n/a nM
Citation Hanson, JReynaud, DQiao, NDevel, PMoray, ALRenard, JFKelley, LPWinum, JYMontero, JLKinsella, BTPirotte, BPace-Asciak, CRDogné, JM Synthesis and pharmacological evaluation of novel nitrobenzenic thromboxane modulators as antiplatelet agents acting on both the alpha and beta isoforms of the human thromboxane receptor. J Med Chem49:3701-9 (2006) 
 
Thromboxane A2 receptor
Name:Thromboxane A2 receptor
Type:Enyzme
Mol. Mass.:37445.28
Organism:Homo sapiens (Human)
Description:P21731
Residue:343
BDBM50188609
NameBDBM50188609
Synonyms:CHEMBL209245 | N-benzyl-N'-[2-(4-methylphenylamino)-5-nitrobenzenesulfonyl]urea
TypeSmall organic molecule
Emp. Form.C21H20N4O5S
Mol. Mass.440.472
SMILESCc1ccc(Nc2ccc(cc2S(=O)(=O)NC(=O)NCc2ccccc2)[N+]([O-])=O)cc1