Reaction Details
Target5-hydroxytryptamine receptor 2A
LigandBDBM50190203
Substrate/Competitorn/a
Meas. Tech.ChEMBL_391339 (CHEMBL870475)
Ki 0.9±n/a nM
Citation Sasikumar, TKBurnett, DAZhang, HSmith-Torhan, AFawzi, ALachowicz, JE Hydrazides of clozapine: a new class of D1 dopamine receptor subtype selective antagonists. Bioorg Med Chem Lett16:4543-7 (2006) 
 
5-hydroxytryptamine receptor 2A
Name:5-hydroxytryptamine receptor 2A
Type:undefined
Mol. Mass.:52607.65
Organism:Homo sapiens (Human)
Description:P28223
Residue:471
BDBM50190203
NameBDBM50190203
Synonyms:2-amino-6-chloro-N-[8-chloro-11-(4-methyl-piperazin-1-yl)-dibenzo[b,e][1,4]diazepin-5-yl]-benzamide | CHEMBL378669
TypeSmall organic molecule
Emp. Form.C25H24Cl2N6O
Mol. Mass.495.404
SMILESCN1CCN(CC1)C1=Nc2cc(Cl)ccc2N(NC(=O)c2c(N)cccc2Cl)c2ccccc12