Reaction Details
TargetD(1A) dopamine receptor
LigandBDBM50190057
Substrate/Competitorn/a
Meas. Tech.ChEMBL_391331 (CHEMBL870467)
Ki 47±n/a nM
Citation Sasikumar, TKBurnett, DAZhang, HSmith-Torhan, AFawzi, ALachowicz, JE Hydrazides of clozapine: a new class of D1 dopamine receptor subtype selective antagonists. Bioorg Med Chem Lett16:4543-7 (2006) 
 
D(1A) dopamine receptor
Name:D(1A) dopamine receptor
Type:Enzyme
Mol. Mass.:49303.43
Organism:Homo sapiens (Human)
Description:P21728
Residue:446
BDBM50190057
NameBDBM50190057
Synonyms:CHEMBL215885 | N-[8-chloro-11-(4-methyl-piperazin-1-yl)-dibenzo[b,e][1,4]diazepin-5-yl]-4-methoxy-benzamide
TypeSmall organic molecule
Emp. Form.C26H26ClN5O2
Mol. Mass.475.97
SMILESCOc1ccc(cc1)C(=O)NN1c2ccc(Cl)cc2N=C(N2CCN(C)CC2)c2ccccc12