Reaction Details
Target5-hydroxytryptamine receptor 2A
LigandBDBM50190186
Substrate/Competitorn/a
Meas. Tech.ChEMBL_391339 (CHEMBL870475)
Ki 1.2±n/a nM
Citation Sasikumar, TKBurnett, DAZhang, HSmith-Torhan, AFawzi, ALachowicz, JE Hydrazides of clozapine: a new class of D1 dopamine receptor subtype selective antagonists. Bioorg Med Chem Lett16:4543-7 (2006) 
 
5-hydroxytryptamine receptor 2A
Name:5-hydroxytryptamine receptor 2A
Type:undefined
Mol. Mass.:52607.65
Organism:Homo sapiens (Human)
Description:P28223
Residue:471
BDBM50190186
NameBDBM50190186
Synonyms:CHEMBL213492 | N-[8-chloro-11-(4-methyl-piperazin-1-yl)-dibenzo[b,e][1,4]diazepin-5-yl]-2-fluoro-6-trifluoromethyl-benzamide
TypeSmall organic molecule
Emp. Form.C26H22ClF4N5O
Mol. Mass.531.932
SMILESCN1CCN(CC1)C1=Nc2cc(Cl)ccc2N(NC(=O)c2c(F)cccc2C(F)(F)F)c2ccccc12