Reaction Details
TargetD(4) dopamine receptor
LigandBDBM50190059
Substrate/Competitorn/a
Meas. Tech.ChEMBL_391337 (CHEMBL870473)
Ki 1810±n/a nM
Citation Sasikumar, TKBurnett, DAZhang, HSmith-Torhan, AFawzi, ALachowicz, JE Hydrazides of clozapine: a new class of D1 dopamine receptor subtype selective antagonists. Bioorg Med Chem Lett16:4543-7 (2006) 
 
D(4) dopamine receptor
Name:D(4) dopamine receptor
Type:Enzyme
Mol. Mass.:48373.19
Organism:Homo sapiens (Human)
Description:P21917
Residue:419
BDBM50190059
NameBDBM50190059
Synonyms:CHEMBL425069 | N-[8-chloro-11-(4-methyl-piperazin-1-yl)-dibenzo[b,e][1,4]diazepin-5-yl]-2,6-dimethoxy-benzamide
TypeSmall organic molecule
Emp. Form.C27H28ClN5O3
Mol. Mass.505.996
SMILESCOc1cccc(OC)c1C(=O)NN1c2ccc(Cl)cc2N=C(N2CCN(C)CC2)c2ccccc12