Reaction Details
TargetD(2) dopamine receptor
LigandBDBM50190232
Substrate/Competitorn/a
Meas. Tech.ChEMBL_391332 (CHEMBL870468)
Ki 2997±n/a nM
Citation Sasikumar, TKBurnett, DAZhang, HSmith-Torhan, AFawzi, ALachowicz, JE Hydrazides of clozapine: a new class of D1 dopamine receptor subtype selective antagonists. Bioorg Med Chem Lett16:4543-7 (2006) 
 
D(2) dopamine receptor
Name:D(2) dopamine receptor
Type:Cell-surface receptors
Mol. Mass.:50647.10
Organism:Homo sapiens (Human)
Description:P14416
Residue:443
BDBM50190232
NameBDBM50190232
Synonyms:CHEMBL212896 | thiophene-3-carboxylic acid [8-chloro-11-(4-methyl-piperazin-1-yl)-dibenzo[b,e][1,4]diazepin-5-yl]-amide
TypeSmall organic molecule
Emp. Form.C23H22ClN5OS
Mol. Mass.451.972
SMILESCN1CCN(CC1)C1=Nc2cc(Cl)ccc2N(NC(=O)c2ccsc2)c2ccccc12