Reaction Details
TargetSodium-dependent dopamine transporter
LigandBDBM22165
Substrate/Competitorn/a
Meas. Tech.ChEMBL_372237 (CHEMBL853390)
Ki 11±n/a nM
Citation Zhang, SFernandez, FHazeldine, SDeschamps, JZhen, JReith, MEDutta, AK Further structural exploration of trisubstituted asymmetric pyran derivatives (2S,4R,5R)-2-benzhydryl-5-benzylamino-tetrahydropyran-4-ol and their corresponding disubstituted (3S,6S) pyran derivatives: a proposed pharmacophore model for high-affinity interaction with the dopamine, serotonin, and no J Med Chem49:4239-47 (2006) 
 
Sodium-dependent dopamine transporter
Name:Sodium-dependent dopamine transporter
Type:Multi-pass membrane protein
Mol. Mass.:68749.45
Organism:Rattus norvegicus (rat)
Description:P23977
Residue:619
BDBM22165
NameBDBM22165
Synonyms:1-{2-[bis(4-fluorophenyl)methoxy]ethyl}-4-(3-phenylpropyl)piperazine CHEMBL281594 CHEMBL543876 GBR-12909 US9944618, Compound ID No. 175 | Vanoxerine
TypeSmall organic molecule
Emp. Form.C28H32F2N2O
Mol. Mass.450.5633
SMILESFc1ccc(cc1)C(OCCN1CCN(CCCc2ccccc2)CC1)c1ccc(F)cc1