Reaction Details
TargetKelch-like ECH-associated protein 1
LigandBDBM50539550
Substrate/Competitorn/a
Meas. Tech.ChEMBL_2262606 (CHEMBL5217617)
Kd 0.700000±n/a nM
Citation Narayanan, DTran, KTPallesen, JSSolbak, SMØQin, YMukminova, ELuchini, MVasilyeva, KOGonzález Chichón, DGoutsiou, GPoulsen, CHaapanen, NPopowicz, GMSattler, MOlagnier, DGajhede, MBach, A Development of Noncovalent Small-Molecule Keap1-Nrf2 Inhibitors by Fragment-Based Drug Discovery. J Med Chem65:14481-14526 (2022) 
 
Kelch-like ECH-associated protein 1
Name:Kelch-like ECH-associated protein 1
Type:PROTEIN
Mol. Mass.:69664.53
Organism:Homo sapiens (Human)
Description:ChEMBL_107924
Residue:624
BDBM50539550
NameBDBM50539550
Synonyms:CHEMBL4643134
TypeSmall organic molecule
Emp. Form.C32H36N4O3
Mol. Mass.524.6532
SMILESCCn1nnc2c(C)c(ccc12)[C@@H](CC(O)=O)c1ccc2CCN(Cc2c1)C(=O)c1c(C)c(C)cc(C)c1C