Reaction Details
TargetMelanocortin receptor 4
LigandBDBM50191556
Substrate/Competitorn/a
Meas. Tech.ChEMBL_376973 (CHEMBL871434)
Ki 10±n/a nM
Citation Tian, XField, TBSwitzer, AGMazur, AWEbetino, FHWos, JABerberich, SMJayasinghe, LRObringer, CMDowty, MEPinney, BBFarmer, JACrossdoersen, DSheldon, RJ Design, synthesis, and evaluation of proline and pyrrolidine based melanocortin receptor agonists. A conformationally restricted dipeptide mimic approach. J Med Chem49:4745-61 (2006) 
 
Melanocortin receptor 4
Name:Melanocortin receptor 4
Type:Enzyme
Mol. Mass.:36949.50
Organism:Homo sapiens (Human)
Description:P32245
Residue:332
BDBM50191556
NameBDBM50191556
Synonyms:(S)-N-((R)-1-((2S,4R)-2-(3-guanidinopropyl)-4-(naphthalen-2-ylmethoxy)pyrrolidin-1-yl)-1-oxo-3-phenylpropan-2-yl)-1,2,3,4-tetrahydroisoquinoline-3-carboxamide | CHEMBL214347
TypeSmall organic molecule
Emp. Form.C38H44N6O3
Mol. Mass.632.7944
SMILES[#7]\[#6](-[#7])=[#7]\[#6]-[#6]-[#6]-[#6@H]-1-[#6]-[#6@H](-[#6]-[#7]-1-[#6](=O)-[#6@@H](-[#6]-c1ccccc1)-[#7]-[#6](=O)-[#6@@H]-1-[#6]-c2ccccc2-[#6]-[#7]-1)-[#8]-[#6]-c1ccc2ccccc2c1