Reaction Details
TargetMelanocyte-stimulating hormone receptor
LigandBDBM50191551
Substrate/Competitorn/a
Meas. Tech.ChEMBL_376971 (CHEMBL853374)
Ki 15±n/a nM
Citation Tian, XField, TBSwitzer, AGMazur, AWEbetino, FHWos, JABerberich, SMJayasinghe, LRObringer, CMDowty, MEPinney, BBFarmer, JACrossdoersen, DSheldon, RJ Design, synthesis, and evaluation of proline and pyrrolidine based melanocortin receptor agonists. A conformationally restricted dipeptide mimic approach. J Med Chem49:4745-61 (2006) 
 
Melanocyte-stimulating hormone receptor
Name:Melanocyte-stimulating hormone receptor
Type:Enzyme
Mol. Mass.:34717.23
Organism:Homo sapiens (Human)
Description:Q01726
Residue:317
BDBM50191551
NameBDBM50191551
Synonyms:(2R,4R)-1-((R)-2-((S)-2-amino-3-(1H-imidazol-4-yl)propanamido)-3-phenylpropanoyl)-N-(2-guanidinoethyl)-4-(naphthalen-2-ylmethoxy)pyrrolidine-2-carboxamide | CHEMBL209587
TypeSmall organic molecule
Emp. Form.C34H41N9O4
Mol. Mass.639.7472
SMILESN[C@@H](Cc1cnc[nH]1)C(=O)N[C@H](Cc1ccccc1)C(=O)N1C[C@@H](C[C@@H]1C(=O)NCCN=C(N)N)OCc1ccc2ccccc2c1