Reaction Details
TargetMelanocortin receptor 4
LigandBDBM50191554
Substrate/Competitorn/a
Meas. Tech.ChEMBL_376976 (CHEMBL871437)
EC50 3.7±n/a nM
Citation Tian, XField, TBSwitzer, AGMazur, AWEbetino, FHWos, JABerberich, SMJayasinghe, LRObringer, CMDowty, MEPinney, BBFarmer, JACrossdoersen, DSheldon, RJ Design, synthesis, and evaluation of proline and pyrrolidine based melanocortin receptor agonists. A conformationally restricted dipeptide mimic approach. J Med Chem49:4745-61 (2006) 
 
Melanocortin receptor 4
Name:Melanocortin receptor 4
Type:Enzyme
Mol. Mass.:36949.50
Organism:Homo sapiens (Human)
Description:P32245
Residue:332
BDBM50191554
NameBDBM50191554
Synonyms:(S)-2-acetamido-N-((R)-1-((2S,4R)-2-(3-guanidinopropyl)-4-(naphthalen-2-ylmethoxy)pyrrolidin-1-yl)-1-oxo-3-phenylpropan-2-yl)-3-(1H-imidazol-4-yl)propanamide | CHEMBL379508
TypeSmall organic molecule
Emp. Form.C36H44N8O4
Mol. Mass.652.7858
SMILESCC(=O)N[C@@H](Cc1cnc[nH]1)C(=O)N[C@H](Cc1ccccc1)C(=O)N1C[C@@H](C[C@@H]1CCCN=C(N)N)OCc1ccc2ccccc2c1