Reaction Details
TargetC5a anaphylatoxin chemotactic receptor 1
LigandBDBM50192060
Substrate/Competitorn/a
Meas. Tech.ChEMBL_394610 (CHEMBL910269)
IC50 300±n/a nM
Citation Schnatbaum, KLocardi, EScharn, DRichter, UHawlisch, HKnolle, JPolakowski, T Peptidomimetic C5a receptor antagonists with hydrophobic substitutions at the C-terminus: increased receptor specificity and in vivo activity. Bioorg Med Chem Lett16:5088-92 (2006) 
 
C5a anaphylatoxin chemotactic receptor 1
Name:C5a anaphylatoxin chemotactic receptor 1
Type:Enzyme
Mol. Mass.:39347.68
Organism:Homo sapiens (Human)
Description:P21730
Residue:350
BDBM50192060
NameBDBM50192060
Synonyms:Ac-Phe-[Orn-Pro-cha-Trp-Ocg] | CHEMBL374494
TypeSmall organic molecule
Emp. Form.C51H72N8O7
Mol. Mass.909.1668
SMILESCCCCCCCC[C@@H]1NC(=O)[C@H](Cc2c[nH]c3ccccc23)NC(=O)[C@@H](CC2CCCCC2)NC(=O)[C@@H]2CCCN2C(=O)[C@H](CCCNC1=O)NC(=O)[C@H](Cc1ccccc1)NC(C)=O