Reaction Details
TargetC5a anaphylatoxin chemotactic receptor 1
LigandBDBM50192036
Substrate/Competitorn/a
Meas. Tech.ChEMBL_394610 (CHEMBL910269)
IC50 57±n/a nM
Citation Schnatbaum, KLocardi, EScharn, DRichter, UHawlisch, HKnolle, JPolakowski, T Peptidomimetic C5a receptor antagonists with hydrophobic substitutions at the C-terminus: increased receptor specificity and in vivo activity. Bioorg Med Chem Lett16:5088-92 (2006) 
 
C5a anaphylatoxin chemotactic receptor 1
Name:C5a anaphylatoxin chemotactic receptor 1
Type:Enzyme
Mol. Mass.:39347.68
Organism:Homo sapiens (Human)
Description:P21730
Residue:350
BDBM50192036
NameBDBM50192036
Synonyms:Ac-Phe-[Orn-Pro-cha-Trp-Hle] | CHEMBL435921
TypeSmall organic molecule
Emp. Form.C48H66N8O7
Mol. Mass.867.087
SMILESCC(C)CC[C@@H]1NC(=O)[C@H](Cc2c[nH]c3ccccc23)NC(=O)[C@@H](CC2CCCCC2)NC(=O)[C@@H]2CCCN2C(=O)[C@H](CCCNC1=O)NC(=O)[C@H](Cc1ccccc1)NC(C)=O