Reaction Details
TargetC5a anaphylatoxin chemotactic receptor 1
LigandBDBM50192064
Substrate/Competitorn/a
Meas. Tech.ChEMBL_394610 (CHEMBL910269)
IC50 146±n/a nM
Citation Schnatbaum, KLocardi, EScharn, DRichter, UHawlisch, HKnolle, JPolakowski, T Peptidomimetic C5a receptor antagonists with hydrophobic substitutions at the C-terminus: increased receptor specificity and in vivo activity. Bioorg Med Chem Lett16:5088-92 (2006) 
 
C5a anaphylatoxin chemotactic receptor 1
Name:C5a anaphylatoxin chemotactic receptor 1
Type:Enzyme
Mol. Mass.:39347.68
Organism:Homo sapiens (Human)
Description:P21730
Residue:350
BDBM50192064
NameBDBM50192064
Synonyms:Ac-Phe-[Orn-Pro-cha-Trp-Hch] | CHEMBL219386
TypeSmall organic molecule
Emp. Form.C51H70N8O7
Mol. Mass.907.1509
SMILESCC(=O)N[C@@H](Cc1ccccc1)C(=O)N[C@H]1CCCNC(=O)[C@H](CCC2CCCCC2)NC(=O)[C@H](Cc2c[nH]c3ccccc23)NC(=O)[C@@H](CC2CCCCC2)NC(=O)[C@@H]2CCCN2C1=O