Reaction Details
TargetC5a anaphylatoxin chemotactic receptor 1
LigandBDBM50192040
Substrate/Competitorn/a
Meas. Tech.ChEMBL_394610 (CHEMBL910269)
IC50 535±n/a nM
Citation Schnatbaum, KLocardi, EScharn, DRichter, UHawlisch, HKnolle, JPolakowski, T Peptidomimetic C5a receptor antagonists with hydrophobic substitutions at the C-terminus: increased receptor specificity and in vivo activity. Bioorg Med Chem Lett16:5088-92 (2006) 
 
C5a anaphylatoxin chemotactic receptor 1
Name:C5a anaphylatoxin chemotactic receptor 1
Type:Enzyme
Mol. Mass.:39347.68
Organism:Homo sapiens (Human)
Description:P21730
Residue:350
BDBM50192040
NameBDBM50192040
Synonyms:Ac-Phe-Orn-Pro-cha-Trp-Arg-OH | CHEMBL409977
TypeSmall organic molecule
Emp. Form.C47H67N11O8
Mol. Mass.914.1038
SMILESCC(=O)N[C@@H](Cc1ccccc1)C(=O)N[C@@H](CCCN)C(=O)N1CCC[C@H]1C(=O)N[C@H](CC1CCCCC1)C(=O)N[C@H](Cc1c[nH]c2ccccc12)C(=O)N[C@H](CCCN=C(N)N)C(O)=O