Reaction Details
TargetC5a anaphylatoxin chemotactic receptor 1
LigandBDBM50192061
Substrate/Competitorn/a
Meas. Tech.ChEMBL_394610 (CHEMBL910269)
IC50 25±n/a nM
Citation Schnatbaum, KLocardi, EScharn, DRichter, UHawlisch, HKnolle, JPolakowski, T Peptidomimetic C5a receptor antagonists with hydrophobic substitutions at the C-terminus: increased receptor specificity and in vivo activity. Bioorg Med Chem Lett16:5088-92 (2006) 
 
C5a anaphylatoxin chemotactic receptor 1
Name:C5a anaphylatoxin chemotactic receptor 1
Type:Enzyme
Mol. Mass.:39347.68
Organism:Homo sapiens (Human)
Description:P21730
Residue:350
BDBM50192061
NameBDBM50192061
Synonyms:Ac-Phe-[Orn-Ala-cha-Trp-Arg] | CHEMBL405646
TypeSmall organic molecule
Emp. Form.C45H63N11O7
Mol. Mass.870.0512
SMILESC[C@@H]1NC(=O)[C@H](CCCNC(=O)[C@H](CCCNC(N)=N)NC(=O)[C@H](Cc2c[nH]c3ccccc23)NC(=O)[C@@H](CC2CCCCC2)NC1=O)NC(=O)[C@H](Cc1ccccc1)NC(C)=O