Reaction Details
TargetAngiopoietin-1 receptor
LigandBDBM50192705
Substrate/Competitorn/a
Meas. Tech.ChEMBL_422205 (CHEMBL856491)
IC50 1±n/a nM
Citation Becknell, NCZulli, ALAngeles, TSYang, SAlbom, MSAimone, LDRobinson, CChang, HHudkins, RL Novel C-3 N-urea, amide, and carbamate dihydroindazolo[5,4-a]pyrrolo[3,4-c]carbazole analogs as potent TIE-2 and VEGF-R2 dual inhibitors. Bioorg Med Chem Lett16:5368-72 (2006) 
 
Angiopoietin-1 receptor
Name:Angiopoietin-1 receptor
Type:Enzyme
Mol. Mass.:125835.70
Organism:Homo sapiens (Human)
Description:Q02763
Residue:1124
BDBM50192705
NameBDBM50192705
Synonyms:1-(2-fluoro-5-methylphenyl)-3-{19-methyl-14-oxo-3-propyl-3,13,19,20-tetraazahexacyclo[14.7.0.0^{2,10}.0^{4,9}.0^{11,15}.0^{17,21}]tricosa-1(16),2(10),4,6,8,11(15),17,20-octaen-7-yl}urea | CHEMBL218252
TypeSmall organic molecule
Emp. Form.C31H29FN6O2
Mol. Mass.536.5994
SMILESCCCn1c2ccc(NC(=O)Nc3cc(C)ccc3F)cc2c2c3CNC(=O)c3c3-c4cn(C)nc4CCc3c12