Reaction Details
TargetVitamin K-dependent protein C
LigandBDBM50193226
Substrate/Competitorn/a
Meas. Tech.ChEMBL_381887 (CHEMBL870370)
IC50 44000±n/a nM
Citation De Nanteuil, GGloanec, PBéguin, SGiesen, PLHemker, HCMennecier, PRupin, AVerbeuren, TJ Low molecular weight activated protein C inhibitors as a potential treatment for hemophilic disorders. J Med Chem49:5047-50 (2006) 
 
Vitamin K-dependent protein C
Name:Vitamin K-dependent protein C
Type:Enzyme
Mol. Mass.:52067.73
Organism:Homo sapiens (Human)
Description:n/a
Residue:461
BDBM50193226
NameBDBM50193226
Synonyms:CHEMBL215801 | {1-[2-(4-carbamimidoyl-benzylcarbamoyl)-indan-2-ylcarbamoyl]-1-methyl-ethylamino}-acetic acid
TypeSmall organic molecule
Emp. Form.C24H29N5O4
Mol. Mass.451.5182
SMILESCC(C)(NCC(O)=O)C(=O)NC1(Cc2ccccc2C1)C(=O)NCc1ccc(cc1)C(N)=N