Reaction Details
TargetProthrombin
LigandBDBM50193230
Substrate/Competitorn/a
Meas. Tech.ChEMBL_381888 (CHEMBL870372)
IC50 770±n/a nM
Citation De Nanteuil, GGloanec, PBéguin, SGiesen, PLHemker, HCMennecier, PRupin, AVerbeuren, TJ Low molecular weight activated protein C inhibitors as a potential treatment for hemophilic disorders. J Med Chem49:5047-50 (2006) 
 
Prothrombin
Name:Prothrombin
Type:Protein
Mol. Mass.:70029.57
Organism:Homo sapiens (Human)
Description:P00734
Residue:622
BDBM50193230
NameBDBM50193230
Synonyms:CHEMBL215639 | {(R)-1-[2-(4-carbamimidoyl-benzylcarbamoyl)-2,3-dihydro-1H-cyclopenta[a]naphthalen-2-ylcarbamoyl]-2-methyl-propylamino}-acetic acid
TypeSmall organic molecule
Emp. Form.C29H33N5O4
Mol. Mass.515.6034
SMILESCC(C)[C@@H](NCC(O)=O)C(=O)NC1(Cc2ccc3ccccc3c2C1)C(=O)NCc1ccc(cc1)C(N)=N