Reaction Details
TargetProthrombin
LigandBDBM50193233
Substrate/Competitorn/a
Meas. Tech.ChEMBL_381888 (CHEMBL870372)
IC50>33000±n/a nM
Citation De Nanteuil, GGloanec, PBéguin, SGiesen, PLHemker, HCMennecier, PRupin, AVerbeuren, TJ Low molecular weight activated protein C inhibitors as a potential treatment for hemophilic disorders. J Med Chem49:5047-50 (2006) 
 
Prothrombin
Name:Prothrombin
Type:Protein
Mol. Mass.:70029.57
Organism:Homo sapiens (Human)
Description:P00734
Residue:622
BDBM50193233
NameBDBM50193233
Synonyms:CHEMBL424901 | {(R)-1-[2-(4-carbamimidoyl-benzylcarbamoyl)-5,6-dimethoxy-indan-2-ylcarbamoyl]-2-methyl-propylamino}-acetic acid
TypeSmall organic molecule
Emp. Form.C27H35N5O6
Mol. Mass.525.5967
SMILESCOc1cc2CC(Cc2cc1OC)(NC(=O)[C@H](NCC(O)=O)C(C)C)C(=O)NCc1ccc(cc1)C(N)=N