Reaction Details
TargetVitamin K-dependent protein C
LigandBDBM50193235
Substrate/Competitorn/a
Meas. Tech.ChEMBL_381887 (CHEMBL870370)
IC50 1070±n/a nM
Citation De Nanteuil, GGloanec, PBéguin, SGiesen, PLHemker, HCMennecier, PRupin, AVerbeuren, TJ Low molecular weight activated protein C inhibitors as a potential treatment for hemophilic disorders. J Med Chem49:5047-50 (2006) 
 
Vitamin K-dependent protein C
Name:Vitamin K-dependent protein C
Type:Enzyme
Mol. Mass.:52067.73
Organism:Homo sapiens (Human)
Description:n/a
Residue:461
BDBM50193235
NameBDBM50193235
Synonyms:CHEMBL215870 | {(R)-1-[6-(4-carbamimidoyl-benzylcarbamoyl)-6,7-dihydro-5H-[1]pyrindin-6-ylcarbamoyl]-2-methyl-propylamino}-acetic acid
TypeSmall organic molecule
Emp. Form.C24H30N6O4
Mol. Mass.466.5328
SMILESCC(C)[C@@H](NCC(O)=O)C(=O)NC1(Cc2cccnc2C1)C(=O)NCc1ccc(cc1)C(N)=N