Reaction Details
TargetProthrombin
LigandBDBM50193242
Substrate/Competitorn/a
Meas. Tech.ChEMBL_381888 (CHEMBL870372)
IC50 13340±n/a nM
Citation De Nanteuil, GGloanec, PBéguin, SGiesen, PLHemker, HCMennecier, PRupin, AVerbeuren, TJ Low molecular weight activated protein C inhibitors as a potential treatment for hemophilic disorders. J Med Chem49:5047-50 (2006) 
 
Prothrombin
Name:Prothrombin
Type:Protein
Mol. Mass.:70029.57
Organism:Homo sapiens (Human)
Description:P00734
Residue:622
BDBM50193242
NameBDBM50193242
Synonyms:CHEMBL212789 | {(R)-1-[(S)-1-(4-carbamimidoyl-benzylcarbamoyl)-2-phenyl-ethylcarbamoyl]-2-methyl-propylamino}-acetic acid
TypeSmall organic molecule
Emp. Form.C24H31N5O4
Mol. Mass.453.534
SMILESCC(C)[C@@H](NCC(O)=O)C(=O)N[C@@H](Cc1ccccc1)C(=O)NCc1ccc(cc1)C(N)=N