Reaction Details
TargetLysophosphatidic acid receptor 1
LigandBDBM50193515
Substrate/Competitorn/a
Meas. Tech.ChEMBL_385201 (CHEMBL868013)
IC50 106±n/a nM
Citation Xu, YJiang, GTsukahara, RFujiwara, YTigyi, GPrestwich, GD Phosphonothioate and fluoromethylene phosphonate analogues of cyclic phosphatidic acid: Novel antagonists of lysophosphatidic acid receptors. J Med Chem49:5309-15 (2006) 
 
Lysophosphatidic acid receptor 1
Name:Lysophosphatidic acid receptor 1
Type:Enzyme
Mol. Mass.:41120.55
Organism:Homo sapiens (Human)
Description:Q92633
Residue:364
BDBM50193515
NameBDBM50193515
Synonyms:1-fluoro-(3S)-hydroxyl-4-oleoyloxylbutane 1,3-cyclic phosphonate | CHEMBL210117
TypeSmall organic molecule
Emp. Form.C22H42FO5P
Mol. Mass.436.538
(=O)OC[C@@H]1CC(F)P(O)(=O)O1