Reaction Details
TargetLysophosphatidic acid receptor 1
LigandBDBM50193518
Substrate/Competitorn/a
Meas. Tech.ChEMBL_385201 (CHEMBL868013)
Ki 314±n/a nM
Citation Xu, YJiang, GTsukahara, RFujiwara, YTigyi, GPrestwich, GD Phosphonothioate and fluoromethylene phosphonate analogues of cyclic phosphatidic acid: Novel antagonists of lysophosphatidic acid receptors. J Med Chem49:5309-15 (2006) 
 
Lysophosphatidic acid receptor 1
Name:Lysophosphatidic acid receptor 1
Type:Enzyme
Mol. Mass.:41120.55
Organism:Homo sapiens (Human)
Description:Q92633
Residue:364
BDBM50193518
NameBDBM50193518
Synonyms:3-hydroxyl-4-palmitoyloxylbutane 1,3-cyclic phosphonothioate | CHEMBL211465
TypeSmall organic molecule
Emp. Form.C20H39O4PS
Mol. Mass.406.56
(=O)OCC1CCP(O)(=S)O1