Reaction Details
TargetReverse transcriptase/RNaseH
LigandBDBM50192301
Substrate/Competitorn/a
Meas. Tech.ChEMBL_386501 (CHEMBL870409)
IC50 8100±n/a nM
Citation García-Aparicio, CBonache, MCDe Meester, ISan-Félix, ABalzarini, JCamarasa, MJVelazquez, S Design and discovery of a novel dipeptidyl-peptidase IV (CD26)-based prodrug approach. J Med Chem49:5339-51 (2006) 
 
Reverse transcriptase/RNaseH
Name:Reverse transcriptase/RNaseH
Type:PROTEIN
Mol. Mass.:65229.15
Organism:Human immunodeficiency virus 1
Description:ChEMBL_1473730
Residue:566
BDBM50192301
NameBDBM50192301
Synonyms:1-[(5R,6R,8R,9R)-4-amino-9-(tert-butyl-dimethyl-silanyloxy)-6-(tert-butyl-dimethyl-silanyloxymethyl)-2,2-dioxo-1,7-dioxa-2lambda*6*-thia-spiro[4.4]non-3-en-8-yl]-3-(3-amino-propyl)-5-methyl-1H-pyrimidine-2,4-dione | CHEMBL380100
TypeSmall organic molecule
Emp. Form.C27H50N4O8SSi2
Mol. Mass.646.944
SMILESCc1cn([C@@H]2O[C@H](CO[Si](C)(C)C(C)(C)C)[C@@]3(OS(=O)(=O)C=C3N)[C@H]2O[Si](C)(C)C(C)(C)C)c(=O)n(CCCN)c1=O