Reaction Details
TargetReverse transcriptase/RNaseH
LigandBDBM50193559
Substrate/Competitorn/a
Meas. Tech.ChEMBL_386501 (CHEMBL870409)
IC50 4800±n/a nM
Citation García-Aparicio, CBonache, MCDe Meester, ISan-Félix, ABalzarini, JCamarasa, MJVelazquez, S Design and discovery of a novel dipeptidyl-peptidase IV (CD26)-based prodrug approach. J Med Chem49:5339-51 (2006) 
 
Reverse transcriptase/RNaseH
Name:Reverse transcriptase/RNaseH
Type:PROTEIN
Mol. Mass.:65229.15
Organism:Human immunodeficiency virus 1
Description:ChEMBL_1473730
Residue:566
BDBM50193559
NameBDBM50193559
Synonyms:CHEMBL214795 | [1-[2',5'-bis-O-(tert-butyldimethylsilyl)-beta-D-ribofuranosyl]-3-N-[3-N'-[(2S,3R,4S)-3,4-dihydroxyprolylamino]propyl]thymine]-3'-spiro-5''-[4''-amino-1'',2''-oxathiole-2'',2''-dioxide]
TypeSmall organic molecule
Emp. Form.C37H66N6O12SSi2
Mol. Mass.875.189
SMILESCC(C)[C@H](N)C(=O)N1C[C@H](O)[C@H](O)[C@H]1C(=O)NCCCn1c(=O)c(C)cn(C2OC(CO[Si](C)(C)C(C)(C)C)C3(OS(=O)(=O)C=C3N)C2O[Si](C)(C)C(C)(C)C)c1=O