Reaction Details
TargetMelanin-concentrating hormone receptor 1
LigandBDBM50193678
Substrate/Competitorn/a
Meas. Tech.ChEMBL_421373 (CHEMBL856555)
IC50 5±n/a nM
Citation Jiang, JHoang, MYoung, JRChaung, DEid, RTurner, CLin, PTong, XWang, JTan, CFeighner, SPalyha, OHreniuk, DLPan, JSailer, AWMacNeil, DJHoward, AShearman, LStribling, SCamacho, RStrack, AVan der Ploeg, LHGoulet, MTDeVita, RJ 2-Aminoquinoline melanin-concentrating hormone (MCH)1R antagonists. Bioorg Med Chem Lett16:5270-4 (2006) 
 
Melanin-concentrating hormone receptor 1
Name:Melanin-concentrating hormone receptor 1
Type:G Protein-Coupled Receptor (GPCR)
Mol. Mass.:45976.27
Organism:Homo sapiens (Human)
Description:Membranes from CHO-K1 cells stably expressing human MCH1R were used in assays.
Residue:422
BDBM50193678
NameBDBM50193678
Synonyms:1-(6-{13-[4-(trifluoromethyl)phenyl]tridecanamido}quinolin-2-yl)-1-azabicyclo[2.2.2]octan-1-ylium | CHEMBL263686
TypeSmall organic molecule
Emp. Form.C36H47F3N3O
Mol. Mass.594.7725
SMILESFC(F)(F)c1ccc(CCCCCCCCCCCCC(=O)Nc2ccc3nc(ccc3c2)[N+]23CCC(CC2)CC3)cc1